{"text_format":"1","workbook":"xlsx","n_sheets":5,"sheets":["Sheet1","Sheet3","Sheet5","Sheet4","Sheet2"],"not_rendered":{"charts":0,"images":1,"macros":1,"external_links":0,"defined_names":1,"comments":2,"pivot_tables":0},"unopened":[],"bounds":{"document_bytes":16777216,"sheet_cells":100000,"rows_first":2000,"rows_last":500,"rows_between":2000,"halvings":0,"cell_chars":16384,"cell_head_chars":4096},"cells_cut":0,"cells_raw":0,"read":"whole","date_system":"1900"}

{"sheet":"Sheet1","index":0,"n_rows":47,"n_cols":23,"rows_kept":47,"cut":false,"hidden":false,"merged":[[1,0,1,22],[2,1,2,8],[3,0,3,16],[4,2,4,8],[4,10,4,11],[4,12,4,13],[2,11,2,15],[2,21,2,22],[3,21,3,22],[4,21,4,22],[2,17,2,19],[3,17,3,19],[4,17,4,19],[0,0,0,22],[22,21,24,22],[21,0,21,22],[22,5,24,6],[22,7,24,9],[22,10,22,16],[22,17,24,17],[22,19,24,19],[13,0,13,1],[13,2,13,5],[13,6,13,8],[10,2,12,5],[10,6,12,8],[19,0,19,21],[20,0,20,22],[10,16,12,16],[31,0,31,22],[32,0,33,22],[34,0,36,1],[34,2,36,22],[30,0,30,19],[30,21,30,22],[41,0,41,22],[44,0,44,1],[44,2,44,11],[40,12,40,22],[42,0,42,1],[42,2,42,11],[44,19,44,22],[37,0,37,22],[38,0,38,22],[39,0,39,22],[40,0,40,1],[40,2,40,11],[5,17,5,19],[11,9,11,15],[6,2,6,8],[8,0,8,22],[10,0,12,1],[10,17,12,17],[10,19,12,19],[10,21,12,21],[10,22,12,22],[10,9,10,15],[10,20,12,20],[9,0,9,22],[5,21,5,22],[15,0,15,1],[15,2,15,5],[15,6,15,8],[14,6,14,8],[10,18,12,18],[14,0,14,1],[14,2,14,5],[16,0,16,1],[16,2,16,5],[16,6,16,8],[17,0,17,1],[17,2,17,5],[17,6,17,8],[26,21,26,22],[18,0,18,1],[18,2,18,5],[18,6,18,8],[25,5,25,6],[25,7,25,9],[46,0,46,22],[29,5,29,6],[29,7,29,9],[29,21,29,22],[22,0,23,0],[22,1,23,4],[23,10,23,16],[27,5,27,6],[27,7,27,9],[27,21,27,22],[28,5,28,6],[28,7,28,9],[28,21,28,22],[25,21,25,22],[26,5,26,6],[26,7,26,9]]}
["COMMUNITY DEVELOPMENT & REVITALIZATION\nThe Texas General Land Office\nForce Account Labor - Construction Personnel Time Sheet"]
[]
["Subrecipient:",null,null,null,null,null,null,null,null,"Contract Number:",null,null,null,null,null,null,null,"WEEKLY SUMMARY",null,null,null,"COST"]
[null,null,null,null,null,null,null,null,null,null,null,null,null,null,null,null,null,"Personnel",null,null,null,{"$f":"W20","v":{"$error":"#DIV/0!"}}]
["Project Description:",null,null,null,null,null,null,null,null,"Week of:","Start Date",null,null,null,"End Date",null,null,"Equipment",null,null,null,{"$f":"V31","v":{"$error":"#N/A"}}]
[null,null,null,null,null,null,null,null,null,null,null,null,"",null,null,null,null,"TOTAL COSTS:",null,null,null,{"$f":"SUM(V4:W5)","v":{"$error":"#DIV/0!"}}]
["Activity Type "]
[null,null,null,null,""]
["Please note that a separate summary of Construction Personnel Time should be submitted based on the activity type. "]
["Table A: Personnel Costs"]
["Employee Name",null,"Job Classification",null,null,null,"Activity Performed and Location of Work ",null,null,"Hours Worked",null,null,null,null,null,null,"Total Hours -GLO-CDR (Actually worked)","Total Hours - All Work","% of CDR Hours","   Total Leave Hours (All leave in the work week)","% of PTO ","Hourly Rate","Total Cost"]
[null,null,null,null,null,null,null,null,null,"The Subrecipent is allowed to change the days below based on the weekly schedule "]
[null,null,null,null,null,null,null,null,null,"M","T","W","T","F","S","S"]
[null,null,null,null,null,null,null,null,null,null,null,null,null,null,null,null,null,{"$f":"SUM(J14:P14)","v":0},{"$f":"Q14/R14","v":{"$error":"#DIV/0!"}},null,{"$f":"T14*S14","v":{"$error":"#DIV/0!"}},null,{"$f":"(Q14+U14)*V14","v":{"$error":"#DIV/0!"}}]
[null,null,null,null,null,null,null,null,null,null,null,null,null,null,null,null,null,{"$f":"SUM(J15:P15)","v":0},{"$f":"Q15/R15","v":{"$error":"#DIV/0!"}},null,{"$error":"#DIV/0!"},null,{"$f":"(Q15+U15)*V15","v":{"$error":"#DIV/0!"}}]
[null,null,null,null,null,null,null,null,null,null,null,null,null,null,null,null,null,0,{"$error":"#DIV/0!"},null,{"$error":"#DIV/0!"},null,{"$f":"(Q16+U16)*V16","v":{"$error":"#DIV/0!"}}]
[null,null,null,null,null,null,null,null,null,null,null,null,null,null,null,null,null,0,{"$error":"#DIV/0!"},null,{"$error":"#DIV/0!"},null,{"$error":"#DIV/0!"}]
[null,null,null,null,null,null,null,null,null,null,null,null,null,null,null,null,null,0,{"$error":"#DIV/0!"},null,{"$error":"#DIV/0!"},null,{"$error":"#DIV/0!"}]
[null,null,null,null,null,null,null,null,null,null,null,null,null,null,null,null,null,0,{"$error":"#DIV/0!"},null,{"$error":"#DIV/0!"},null,{"$error":"#DIV/0!"}]
["Total Weekly Personnel Costs:",null,null,null,null,null,null,null,null,null,null,null,null,null,null,null,null,null,null,null,null,null,{"$f":"SUM(W14:W19)","v":{"$error":"#DIV/0!"}}]
["*For additional employees please fill out a separate form within the same billing timeframe "]
["Table B: Equipment Costs"]
["FEMA Code","Equipment (type, and size)",null,null,null,"Operator",null,"Activity Performed and Location of Work*",null,null,"Hours/Miles**",null,null,null,null,null,null,"Total Hours/ Miles- GLO-CDR",null,"Hourly/ Fed. Mileage Rate",null,"Total Cost"]
[null,null,null,null,null,null,null,null,null,null,"The Subrecipent is allowed to change the days below based on the weekly schedule "]
["(Select FEMA Code)","Equiptment","Specs.","Capacity/size","HP",null,null,null,null,null,"M","T","W","T","F","S","S"]
[null,{"$f":"VLOOKUP(A26,Sheet3!1:1048576,2)","v":{"$error":"#N/A"}},{"$f":"VLOOKUP(A26,Sheet3!1:1048576,3)","v":{"$error":"#N/A"}},{"$f":"VLOOKUP(A26,Sheet3!1:1048576,4)","v":{"$error":"#N/A"}},{"$f":"VLOOKUP(A26,Sheet3!1:1048576,5)","v":{"$error":"#N/A"}},null,null,null,null,null,null,null,null,null,null,null,null,{"$f":"SUM(K26:Q26)","v":0},null,{"$f":"VLOOKUP(A26,Sheet3!1:1048576,8)","v":{"$error":"#N/A"}},null,{"$f":"R26*T26","v":{"$error":"#N/A"}}]
[null,{"$f":"VLOOKUP(A27,Sheet3!1:1048576,2)","v":{"$error":"#N/A"}},{"$f":"VLOOKUP(A27,Sheet3!1:1048576,3)","v":{"$error":"#N/A"}},{"$f":"VLOOKUP(A27,Sheet3!1:1048576,4)","v":{"$error":"#N/A"}},{"$f":"VLOOKUP(A27,Sheet3!1:1048576,5)","v":{"$error":"#N/A"}},null,null,null,null,null,null,null,null,null,null,null,null,{"$f":"SUM(K27:Q27)","v":0},null,{"$f":"VLOOKUP(A27,Sheet3!1:1048576,8)","v":{"$error":"#N/A"}},null,{"$error":"#N/A"}]
[null,{"$f":"VLOOKUP(A28,Sheet3!1:1048576,2)","v":{"$error":"#N/A"}},{"$f":"VLOOKUP(A28,Sheet3!1:1048576,3)","v":{"$error":"#N/A"}},{"$f":"VLOOKUP(A28,Sheet3!1:1048576,4)","v":{"$error":"#N/A"}},{"$f":"VLOOKUP(A28,Sheet3!1:1048576,5)","v":{"$error":"#N/A"}},null,null,null,null,null,null,null,null,null,null,null,null,0,null,{"$f":"VLOOKUP(A28,Sheet3!1:1048576,8)","v":{"$error":"#N/A"}},null,{"$error":"#N/A"}]
[null,{"$f":"VLOOKUP(A29,Sheet3!1:1048576,2)","v":{"$error":"#N/A"}},{"$f":"VLOOKUP(A29,Sheet3!1:1048576,3)","v":{"$error":"#N/A"}},{"$f":"VLOOKUP(A29,Sheet3!1:1048576,4)","v":{"$error":"#N/A"}},{"$f":"VLOOKUP(A29,Sheet3!1:1048576,5)","v":{"$error":"#N/A"}},null,null,null,null,null,null,null,null,null,null,null,null,0,null,{"$f":"VLOOKUP(A29,Sheet3!1:1048576,8)","v":{"$error":"#N/A"}},null,{"$error":"#N/A"}]
[null,{"$f":"VLOOKUP(A30,Sheet3!1:1048576,2)","v":{"$error":"#N/A"}},{"$f":"VLOOKUP(A30,Sheet3!1:1048576,3)","v":{"$error":"#N/A"}},{"$f":"VLOOKUP(A30,Sheet3!1:1048576,4)","v":{"$error":"#N/A"}},{"$f":"VLOOKUP(A30,Sheet3!1:1048576,5)","v":{"$error":"#N/A"}},null,null,null,null,null,null,null,null,null,null,null,null,0,null,{"$f":"VLOOKUP(A30,Sheet3!1:1048576,8)","v":{"$error":"#N/A"}},null,{"$error":"#N/A"}]
["Total Weekly Equipment Costs",null,null,null,null,null,null,null,null,null,null,null,null,null,null,null,null,null,null,null,null,{"$f":"SUM(V26:W30)","v":{"$error":"#N/A"}}]
["*For additional equiptment please fill out a separate form within the same billing timeframe "]
["-Operator hours described in this table MUST be documented on Table A\n-Vehicles used for transport of people must be based on rate per mile."]
[]
["** Additional Justifications \n(If necessary)"]
[]
[]
[]
["CERTIFICATION: I certify that the above named employees were on the City/County payroll and the equipment described was utilized on the dates stated solely to complete construction activities for GLO-CDR authorized projects as outlined in the Subrecipient's Contract Attachment A.  Activities, times, dates, and amounts are correct to the best of my knowledge. \nWARNING: ANY PERSON WHO KNOWINGLY MAKES A FALSE CLAIM OR STATEMENT TO HUD MAY BE SUBJECT TO CIVIL OR CRIMINAL PENALTIES UNDER 18 U.S.C. § 287, 18 U.S.C. § 1001, AND 31 U.S.C. § 3729."]
[]
["Supervisor Signature"]
[]
["Supervisor Name Printed"]
[]
["Supervisor Title",null,null,null,null,null,null,null,null,null,null,null,null,null,null,null,null,null,null,"Effective September 2018"]
[]
["Disclaimer: The Texas General Land Office has made every effort to ensure the information contained on this form is accurate and in compliance with the most up-to-date CDBG-DR and/or CDBG-MIT federal rules and regulations, as applicable. It should be noted that the Texas General Land Office assumes no liability or responsibility for any error or omission on this form that may result from the interim period between the publication of amended and/or revised federal rules and regulations and the Texas General Land Office's standard review and update schedule."]

{"sheet":"Sheet3","index":1,"n_rows":495,"n_cols":8,"rows_kept":495,"cut":false,"hidden":false,"merged":[[106,7,108,7],[275,0,277,0],[361,0,365,0],[393,7,394,7]]}
["Cost Code","Equipment","Specifications","Capacity or Size","HP","Notes","Unit","2019\nUpdated Rate"]
[8010,"Air Compressor","Air Delivery","41 CFM","to 10","Hoses included.","hour",1.62]
[8011,"Air Compressor","Air Delivery","103 CFM","to 30","Hoses included.","hour",9.86]
[8012,"Air Compressor","Air Delivery","130 CFM","to 50","Hoses included.","hour",12.49]
[8013,"Air Compressor","Air Delivery","175 CFM","to 90","Hoses included.","hour",20.98]
[8014,"Air Compressor","Air Delivery","400 CFM","to 145","Hoses included.","hour",32.130000000000003]
[8015,"Air Compressor","Air Delivery","575 CFM","to 230","Hoses included.","hour",57.05]
[8016,"Air Compressor","Air Delivery","1100 CFM","to 355","Hoses included.","hour",95.6]
[8017,"Air Compressor","Air Delivery","1600 CFM","to 500","Hoses included.","hour",98.55]
[8040,"Ambulance",null,null,"to 150",null,"hour",28.09]
[8041,"Ambulance",null,null,"to 210",null,"hour",41.18]
[8050,"Board, Arrow",null,null,"to 8","Trailer Mounted.","hour",4.53]
[8051,"Board, Message",null,null,"to 5","Trailer Mounted.","hour",11.6]
[8060,"Auger, Portable","Hole Diameter","16 In","to 6",null,"hour",2.34]
[8061,"Auger, Portable","Hole Diameter","18 In","to 13",null,"hour",4.6500000000000004]
[8062,"Auger, Tractor Mntd","Max. Auger Diameter","36 In","to 13","Includes digger, boom and\nmounting hardware.","hour",3.25]
[8063,"Auger, Truck Mntd","Max. Auger Size","24 In","to 100","Includes digger, boom and mounting hardware.  Add this rate to tractor rate for total auger and tractor rate.","hour",34.93]
[8064,"Hydraulic Post Driver",null,null,null,null,"hour",35.270000000000003]
[8065,"Auger","Horizontal Directional Boring\nMachine","250 X 100",300,"DD-140B YR-2003","hour",172.29]
[8066,"Auger","Horizontal Directional Boring\nMachine","50 X 100",24,"Average to 7,000 lbs","hour",33.83]
[8067,"Auger, Directional Boring Machine","Auger, Directional Boring Machine","7,000 - 10,000 lbs",45,"JT920L (2013)","hour",41.04]
[8068,"Bush Hog","Bush Hog - Model 326","Single Spindle Rotary Cutters",null,null,"hour",20.61]
["8068-1","Bush Hog","Bush Hog - Model 3210","Lift, Pull, Semi-Mount & Offset Model",null,null,"hour",28.74]
["8068-2","Bush Hog","Bush Hog - Model 2815","Flex Wing Rotary Cutters",null,null,"hour",43.17]
[8070,"Automobile",null,null,"to 130","Transporting people.","mile",0.54500000000000004]
[8071,"Automobile",null,null,"to 130","Transporting cargo.","hour",12.43]
[8072,"Automobile, Police",null,null,"to 250","Patrolling.","mile",0.54500000000000004]
[8073,"Automobile, Police",null,null,"to 250","Stationary with engine running.","hour",16.05]
[8075,"Motorcycle, Police",null,null,null,null,"mile",0.505]
[8076,"Automibile - Chevy Trailblazer","6 or 8 cl",null,"285 to 300",null,"hour",23.99]
[8077,"Automobile - Ford Expedition","Fire Command Center","EcoBoost V-6",360,"2015 Model","hour",19.62]
[8078,"MRAP Armored Rescue Vehicle","Search and Rescue","Military Suplus Vehicle","375-450","Qualified foe operational rate on","Hr.",51.8]
[8079,"MRAP C-MTV","Multi-Theater (Military\nSurplus)Vehicle","gvwr 55000 Lbs","to 350","Qualified foe operational rate on","Hr.",48.35]
[8080,"All Terrain Vehicle (ATV)","Engine 110cc, 4-Wheel; 20\" tyre",null,"6.5-7.5",null,"hour",8.23]
[8081,"All Terrain Vehicle (ATV)","Engine 125cc, 4-Wheel; 21\" tyre",null,"7.6-8.6",null,"hour",8.67]
[8082,"All Terrain Vehicle (ATV)","Engine 150cc, 4-Wheel; 22\" tyre",null,"9.0-10.0",null,"hour",8.68]
[8083,"All Terrain Vehicle (ATV)","Engine 200cc, 4-Wheel; 24\" tyre",null,"12-14.0",null,"hour",9.23]
[8084,"All Terrain Vehicle (ATV)","Engine 250cc, 4-Wheel; 24\" tyre",null,"15-17",null,"hour",9.81]
[8085,"All Terrain Vehicle (ATV)","Engine 300cc, 4-Wheel; 24\" tyre",null,"18-20",null,"hour",10.66]
[8086,"All Terrain Vehicle (ATV)","Engine 400cc. 4-Wheel; 25\" tyre",null,"26-28",null,"hour",12.2]
[8087,"All Terrain Vehicle (ATV)","Engine 450cc, 4-Wheel; 25\" tyre",null,"26-28",null,"hour",13.07]
[8088,"All Terrain Vehicle (ATV)","Engine 650cc, 4-Wheel; 25\" tyre",null,"38-40",null,"hour",13.86]
[8089,"All Terrain Vehicle (ATV)","Engine 750cc, 4-Wheel; 25\" tyre",null,"44-46",null,"hour",14.79]
[8110,"Barge, Deck","Size","50'x35'x7.25'",0,"Push by Tug-Boat","hour",52]
[8111,"Barge, Deck","Size","50'x35'x9'",0,"Push by Tug-Boat","hour",61.96]
[8112,"Barge, Deck","Size","120'x45'x10'",0,"Push by Tug-Boat","hour",109.97]
[8113,"Barge, Deck","Size","160'x45'x11''",0,"Push by Tug-Boat","hour",136.9]
[8120,"Boat, Tow","Size","55'x20'x5'","to 870","Steel.","hour",352.71]
[8121,"Boat, Tow","Size","60'x21'x5'","to 1050","Steel.","hour",400.32]
[8122,"Boat, Tow","Size","70'x30'x7.5'","to 1350","Steel.","hour",624.55999999999995]
[8123,"Boat, Tow","Size","120'x34'x8'","to 2000","Steel.","hour",1181.8599999999999]
[8124,"Airboat","815AGIS Airboat w/spray unit","15'x8'",400,null,"hour",32.700000000000003]
[8125,"Airboat","815AGIS Airboat w/spray unit","15'x8'",425,null,"hour",33.06]
[8126,"Swamp Buggy","Conquest",null,360,null,"hour",41.35]
[8130,"Boat, Row",null,null,0,"Heavy duty.","hour",1.46]
[8131,"Boat, Runabout","Size","13'x5'","to 50","Outboard.","hour",12.55]
[8132,"Boat, Tender","Size","14'x7'","to 100","Inboard with 360 degree drive.","hour",16.579999999999998]
[8133,"Boat, Push","Size","45'x21'x6'","to 435","Flat hull.","hour",235.03]
[8134,"Boat, Push","Size","54'x21'x6'","to 525","Flat hull.","hour",290.74]
[8135,"Boat, Push","Size","58'x24'x7.5'","to 705","Flat hull.","hour",355.7]
[8136,"Boat, Push","Size","64'x25'x8'","to 870","Flat hull.","hour",359.36]
[8140,"Boat, Tug","Length","16 Ft","to 100",null,"hour",47.35]
[8141,"Boat, Tug","Length","18 Ft","to 175",null,"hour",70.55]
[8142,"Boat, Tug","Length","26 Ft","to 250",null,"hour",90.1]
[8143,"Boat, Tug","Length","40 Ft","to 380",null,"hour",215.09]
[8144,"Boat, Tug","Length","51 Ft","to 700",null,"hour",302.01]
[8145,"Jet Ski","3-seater",null,null,null,"hour",27.7]
[8146,"Jet Ski",null,null,null,null,"hour",8.6]
[8147,"Boat, Inflatable Rescue Raft","Zodiac",null,0,null,"hour",1.1299999999999999]
[8148,"Boat, Runabout","1544 lbs","11 passenger capacity","190-250",null,"hour",65.510000000000005]
[8149,"Boat, removable engine","2000 Johnson Outboard Motor w 15\" shaft",null,15,null,"hour",1.58]
[8151,"Broom, Pavement","Broom Length","96 In","to 100",null,"hour",30.41]
[8153,"Broom, Pavement, Mntd","Broom Length","72 In","to 18","Add Prime Mover cost for total\nrate","hour",6.24]
[8154,"Broom, Pavement, Pull","Broom Length","84 In","to 20","Add Prime Mover cost for total\nrate","hour",23.75]
[8155,"Broom, Pavement","Broom Length","72 In","to 35",null,"hour",25.28]
[8157,"Sweeper, Pavement",null,null,"to 110",null,"hour",78.790000000000006]
[8158,"Sweeper, Pavement",null,null,"to 230",null,"hour",102.03]
[8180,"Bus",null,null,"to 150",null,"hour",21.6]
[8181,"Bus",null,null,"to 210",null,"hour",25.82]
[8182,"Bus",null,null,"to 300",null,"hour",39.65]
{"$rows_left_out":416}
{"sheet":"Sheet5","index":2,"n_rows":44,"n_cols":1,"rows_kept":44,"cut":false,"hidden":false,"merged":[]}
["1a Water Facilities "]
["1b Sewer Facilities"]
["2 Solid Waste Disposal Facility "]
["3 Other Public Utilities"]
["4 Street Improvements"]
["5 Flood/Drainage Facility "]
["5a Flood/Drainage-Debris Removal "]
["6 Neighborhood Facilities/Community Center"]
["7 Senior Centers"]
["8 Centers for the Handicap"]
["9 Parks and Other Recreation "]
["10 Fire Protection Facilities"]
["13 Specially Authorized Private Facility"]
["14 Specially Authorized Public Facility "]
["15 Public Services"]
["16 Interim Assistance"]
["17 Housing Rehabilitation "]
["17c Housing Reconstruction "]
["17d Rehabilitation-Emergency Facility "]
["18 Rehabilitation- Public Housing"]
["19a Homeownership Assistance"]
["19b Affordable New Housing"]
["20 Clearance/Demolition Activity "]
["21 Historic Preservation"]
["21a DR- Historic Preservation "]
["22 Removal of Architectural "]
["23 Code Enforcement"]
["24 Acquisition "]
["25 Relocation Payment and "]
["26 Economic Development Local "]
["27 Economic Development Intergovernmental "]
["29 Special Activities by Local Govt."]
["30 Engineering/Architecture"]
["31 Planning/Urban Design "]
["31a COG Planning/Project Delivery "]
["32 Administration "]
["33 Planning, Project Delivery "]
["33-35 Environmental Retained "]
["35 Environmental "]
["Single Family Rental Rehab."]
["Single Family Rental Recon."]
["Multi-Family Rental Rehab."]
["Multi-Family Rental Recon."]
["Application and Survey Review "]

{"sheet":"Sheet4","index":3,"n_rows":11,"n_cols":7,"rows_kept":11,"cut":false,"hidden":true,"merged":[]}
["2019-01-01"]
["Sunday","Monday","Tuesday","Wednesday","Thursday","Friday","Saturday"]
[null,null,1,2,3,4,5]
[]
[6,7,8,9,10,11,12]
[]
[13,14,15,16,17,18,19]
[]
[20,21,22,23,24,25,26]
[]
[27,28,29,30,31]

{"sheet":"Sheet2","index":4,"n_rows":44,"n_cols":35,"rows_kept":44,"cut":false,"hidden":true,"merged":[[3,0,3,1],[3,2,3,3],[3,4,3,6],[4,0,4,1],[4,2,4,3],[4,4,4,6],[0,0,0,18],[1,0,2,1],[1,2,2,3],[1,4,2,6],[1,7,1,13],[1,14,2,14],[1,15,2,15],[1,16,2,16],[1,17,2,17],[1,18,2,18],[7,0,7,1],[7,2,7,3],[7,4,7,6],[8,0,8,1],[8,2,8,3],[8,4,8,6],[5,0,5,1],[5,2,5,3],[5,4,5,6],[6,0,6,1],[6,2,6,3],[6,4,6,6],[11,0,11,1],[11,2,11,3],[11,4,11,6],[12,0,12,1],[12,2,12,3],[12,4,12,6],[9,0,9,1],[9,2,9,3],[9,4,9,6],[10,0,10,1],[10,2,10,3],[10,4,10,6],[15,0,15,1],[15,2,15,3],[15,4,15,6],[16,0,16,1],[16,2,16,3],[16,4,16,6],[13,0,13,1],[13,2,13,3],[13,4,13,6],[14,0,14,1],[14,2,14,3],[14,4,14,6],[19,0,19,1],[19,2,19,3],[19,4,19,6],[20,0,20,17],[21,0,21,18],[17,0,17,1],[17,2,17,3],[17,4,17,6],[18,0,18,1],[18,2,18,3],[18,4,18,6],[22,17,23,18],[24,0,24,2],[24,3,24,4],[24,5,24,7],[24,17,24,18],[25,0,25,2],[25,3,25,4],[25,5,25,7],[25,17,25,18],[22,0,23,2],[22,3,23,4],[22,5,23,7],[22,8,22,14],[22,15,23,15],[22,16,23,16],[28,0,28,2],[28,3,28,4],[28,5,28,7],[28,17,28,18],[29,0,29,2],[29,3,29,4],[29,5,29,7],[29,17,29,18],[26,0,26,2],[26,3,26,4],[26,5,26,7],[26,17,26,18],[27,0,27,2],[27,3,27,4],[27,5,27,7],[27,17,27,18],[32,0,32,2],[32,3,32,4],[32,5,32,7],[32,17,32,18],[33,0,33,2],[33,3,33,4],[33,5,33,7],[33,17,33,18],[30,0,30,2],[30,3,30,4],[30,5,30,7],[30,17,30,18],[31,0,31,2],[31,3,31,4],[31,5,31,7],[31,17,31,18],[36,0,36,2],[36,3,36,4],[36,5,36,7],[36,17,36,18],[37,0,37,2],[37,3,37,4],[37,5,37,7],[37,17,37,18],[34,0,34,2],[34,3,34,4],[34,5,34,7],[34,17,34,18],[35,0,35,2],[35,3,35,4],[35,5,35,7],[35,17,35,18],[43,16,43,33],[41,0,41,16],[41,17,41,18],[40,0,40,2],[40,3,40,4],[40,5,40,7],[40,17,40,18],[38,0,38,2],[38,3,38,4],[38,5,38,7],[38,17,38,18],[39,0,39,2],[39,3,39,4],[39,5,39,7],[39,17,39,18]]}
["Table A: Personnel Costs"]
["Employee Name",null,"Job Classification",null,"Activity Performed",null,null,"Hours Worked",null,null,null,null,null,null,"Total Hours -GLO-CDR","Total Hours -       All Work","Total Hours -       All Leave","Hourly Rate","Total Cost"]
[null,null,null,null,null,null,null,"M","T","W","T","F","S","S"]
[null,null,null,null,null,null,null,null,null,null,null,null,null,null,null,{"$f":"SUM(H4:N4)","v":0},null,null,{"$f":"O4*R4","v":0}]
[null,null,null,null,null,null,null,null,null,null,null,null,null,null,null,0,null,null,0]
[null,null,null,null,null,null,null,null,null,null,null,null,null,null,null,0,null,null,0]
[null,null,null,null,null,null,null,null,null,null,null,null,null,null,null,0,null,null,0]
[null,null,null,null,null,null,null,null,null,null,null,null,null,null,null,0,null,null,0]
[null,null,null,null,null,null,null,null,null,null,null,null,null,null,null,0,null,null,0]
[null,null,null,null,null,null,null,null,null,null,null,null,null,null,null,0,null,null,0]
[null,null,null,null,null,null,null,null,null,null,null,null,null,null,null,0,null,null,0]
[null,null,null,null,null,null,null,null,null,null,null,null,null,null,null,0,null,null,0]
[null,null,null,null,null,null,null,null,null,null,null,null,null,null,null,0,null,null,0]
[null,null,null,null,null,null,null,null,null,null,null,null,null,null,null,0,null,null,0]
[null,null,null,null,null,null,null,null,null,null,null,null,null,null,null,0,null,null,0]
[null,null,null,null,null,null,null,null,null,null,null,null,null,null,null,0,null,null,0]
[null,null,null,null,null,null,null,null,null,null,null,null,null,null,null,0,null,null,0]
[null,null,null,null,null,null,null,null,null,null,null,null,null,null,null,0,null,null,0]
[null,null,null,null,null,null,null,null,null,null,null,null,null,null,null,0,null,null,0]
[null,null,null,null,null,null,null,null,null,null,null,null,null,null,null,0,null,null,0]
["Subtotal Weekly Personnel Costs",null,null,null,null,null,null,null,null,null,null,null,null,null,null,null,null,null,{"$f":"SUM(S4:S20)","v":0}]
["Table B: Equipment Costs"]
["Equipment (type, size, & FEMA code)",null,null,"Operator",null,"Activity Performed and Location of Work*",null,null,"Hours/Miles**",null,null,null,null,null,null,"Total Hours/ Miles- GLO-CDR","Hourly/ Fed. Mileage Rate","Total Cost"]
[null,null,null,null,null,null,null,null,"M","T","W","T","F","S","S"]
[null,null,null,null,null,null,null,null,null,null,null,null,null,null,null,null,null,{"$f":"P25*Q25","v":0}]
[null,null,null,null,null,null,null,null,null,null,null,null,null,null,null,null,null,0]
[null,null,null,null,null,null,null,null,null,null,null,null,null,null,null,null,null,0]
[null,null,null,null,null,null,null,null,null,null,null,null,null,null,null,null,null,0]
[null,null,null,null,null,null,null,null,null,null,null,null,null,null,null,null,null,0]
[null,null,null,null,null,null,null,null,null,null,null,null,null,null,null,null,null,0]
[null,null,null,null,null,null,null,null,null,null,null,null,null,null,null,null,null,0]
[null,null,null,null,null,null,null,null,null,null,null,null,null,null,null,null,null,0]
[null,null,null,null,null,null,null,null,null,null,null,null,null,null,null,null,null,0]
[null,null,null,null,null,null,null,null,null,null,null,null,null,null,null,null,null,0]
[null,null,null,null,null,null,null,null,null,null,null,null,null,null,null,null,null,0]
[null,null,null,null,null,null,null,null,null,null,null,null,null,null,null,null,null,0]
[null,null,null,null,null,null,null,null,null,null,null,null,null,null,null,null,null,0]
[null,null,null,null,null,null,null,null,null,null,null,null,null,null,null,null,null,0]
[null,null,null,null,null,null,null,null,null,null,null,null,null,null,null,null,null,0]
[null,null,null,null,null,null,null,null,null,null,null,null,null,null,null,null,null,0]
[null,null,null,null,null,null,null,null,null,null,null,null,null,null,null,null,null,0]
["Subtotal Weekly PersonnEqupipment Costs",null,null,null,null,null,null,null,null,null,null,null,null,null,null,null,null,{"$f":"SUM(R25:S41)","v":0}]
[]
[null,null,null,null,null,null,null,null,null,null,null,null,null,null,null,null,"Subtotal Weekly Personnel Costs",null,null,null,null,null,null,null,null,null,null,null,null,null,null,null,null,null,{"$f":"SUM(AI27:AI43)","v":0}]